{"text_format":"3","workbook":"xlsx","n_sheets":5,"sheets":["omzetting ambt naar ORE","Lijst instellingen","Lijst omzettingen","lijst ambten","Gegevensverzameling"],"not_rendered":{"images":1,"macros":1,"defined_names":4},"read":"whole","date_system":"1900"}

{"sheet":"omzetting ambt naar ORE","index":0,"n_rows":80,"n_cols":38,"rows_kept":80,"merged":[[0,37,0,47],[1,37,1,47],[2,2,2,47],[3,2,3,47],[4,28,11,47],[10,3,10,16],[11,2,11,20],[14,2,14,47],[16,2,16,47],[18,2,18,47],[19,2,19,47],[21,0,21,1],[21,2,21,47],[22,2,22,47],[24,0,24,1],[24,2,24,47],[25,2,25,47],[27,20,27,24],[27,25,27,47],[29,20,29,47],[31,20,31,47],[33,20,33,47],[35,2,35,47],[39,0,39,1],[39,2,39,47],[41,2,41,47],[43,2,43,21],[43,22,43,26],[43,27,43,31],[43,37,43,44],[44,2,44,21],[44,22,44,26],[44,27,44,31],[44,37,44,44],[45,2,45,21],[45,22,45,26],[45,27,45,31],[45,37,45,44],[46,2,46,21],[46,22,46,26],[46,27,46,31],[46,37,46,44],[47,2,47,21],[47,22,47,26],[47,27,47,31],[47,37,47,44],[48,2,48,21],[48,22,48,26],[48,27,48,31],[48,37,48,44],[49,2,49,21],[49,22,49,26],[49,27,49,31],[49,37,49,44],[50,2,50,21],[50,22,50,26],[50,27,50,31],[50,37,50,44],[51,2,51,21],[51,22,51,26],[51,27,51,31],[51,37,51,44],[52,2,52,21],[52,22,52,26],[52,27,52,31],[52,37,52,44],[53,2,53,21],[53,22,53,26],[53,27,53,31],[53,37,53,44],[55,37,55,44],[59,2,59,47],[61,0,61,1],[61,2,61,47],[62,0,62,1],[64,2,64,47],[65,2,65,47],[67,2,67,47],[69,0,69,1],[69,2,69,47],[74,5,74,47],[75,5,75,47],[76,3,76,47],[77,3,77,47],[79,2,79,47]]}
[{"$nulls":37},"1F3C8F-21439-240304"]
[{"$nulls":37},"MDOMZORE"]
[null,null,"Mededeling van de omzetting van eigen financiële middelen in omkaderingsrekeneenheden (ORE)"]
[null,null,"//////////////////////////////////////////////////////////////////////////////////////////////////////////////////////////////////////////////////////////////"]
[null,null,"Agentschap voor Onderwijsdiensten"]
[null,null,"Afdeling Secundair Onderwijs – Scholen en Leerlingen"]
[null,null,"Koning Albert II-laan 15 bus 138"]
[null,null,"1210 BRUSSEL"]
[null,null,"T 02 553 87 14"]
[null,null,"internaten.agodi@ond.vlaanderen.be"]
[]
[null,null,"schoolbeheerteam.basis@ond.vlaanderen.be"]
[]
[null,null,"Waarvoor dient dit formulier?"]
[null,null,"Met dit formulier meldt u de omzetting van de eigen financiële middelen in ORE met als doel de rationalisatienorm van 62.875 ORE te behalen. De omzetting gebeurt door personeel aan te werven vanuit de eigen financiële middelen."]
[null,null,"Wie vult dit formulier in?"]
[null,null,"De gemandateerde van het internaatsbestuur van het onderwijsinternaat vult dit formulier in en verstuurt het via Mijn Onderwijs."]
[null,null,"Waar vindt u meer informatie over dit formulier?"]
[null,null,"Meer informatie vindt u in het decreet over de onderwijsinternaten. Als u vragen hebt, kunt u mailen naar het bovenstaande e-mailadres."]
[]
[]
[]
[null,null,"Gegevens van het internaatsbestuur"]
[]
[1,null,"Vul de gegevens van het onderwijsinternaat in."]
[null,null,"Als u het instellingsnummer invult, verschijnen de andere gegevens van deze vraag automatisch. Neem contact op met uw schoolbeheerteam als een of meer gegevens niet correct zijn."]
[]
[{"$nulls":18},"instellingsnummer"]
[]
[{"$nulls":18},"naam",null,{"$f":"IF(ISBLANK($U$28),\"\",VLOOKUP($U$28,'Lijst instellingen'!$A$2:$D$162,2,FALSE))","v":""}]
[]
[{"$nulls":18},"straat en nummer",null,{"$f":"IF(ISBLANK($U$28),\"\",VLOOKUP($U$28,'Lijst instellingen'!$A$2:$D$162,3,FALSE))","v":""}]
[]
[{"$nulls":18},"postnummer en gemeente",null,{"$f":"IF(ISBLANK($U$28),\"\",VLOOKUP($U$28,'Lijst instellingen'!$A$2:$D$162,4,FALSE))","v":""}]
[]
[null,null,"Omzetting in ORE van ambten die aangeworven zijn uit eigen middelen"]
[]
[]
[]
[2,4,"Vul het aantal uren in per ambt dat aangeworven is vanuit de eigen financiële middelen."]
[]
[null,null,"Vermeld in de onderstaande tabel de gegevens van het personeel dat u met eigen middelen hebt aangeworven. Vul het ambt en de salarisschaal van het personeelslid in en het aantal uren dat het tewerkgesteld is. In de rechtertabel verschijnt automatisch het aantal ORE dat gegenereerd wordt door de aanwerving van dat personeelslid."]
[]
[null,null,"ambt",{"$nulls":19},"salarisschaal",{"$nulls":4},"aantal uren",{"$nulls":9},"omzetting in ORE"]
[{"$nulls":36},{"$f":"IF(ISERROR(AL45),\"!\",IF(AND(AL45=\"\",AL46<>\"\"),\"!\",\"\"))","v":""},{"$f":"IF(AB45=\"\",\"\",IF(AB45=\"voltijds\", 12875, IF(AB45=\"halftijds\",6437,INDEX('Lijst omzettingen'!$B$3:$H$38,MATCH('omzetting ambt naar ORE'!AB45,'Lijst omzettingen'!$A$3:$A$38,0),MATCH('omzetting ambt naar ORE'!W45,'Lijst omzettingen'!$B$1:$H$1)))))","v":""}]
[{"$nulls":36},{"$f":"IF(ISERROR(AL46),\"!\",IF(AND(AL46=\"\",AL47<>\"\"),\"!\",\"\"))","v":""},{"$f":"IF(AB46=\"\",\"\",IF(AB46=\"voltijds\", 12875, IF(AB46=\"halftijds\",6437,INDEX('Lijst omzettingen'!$B$3:$H$38,MATCH('omzetting ambt naar ORE'!AB46,'Lijst omzettingen'!$A$3:$A$38,0),MATCH('omzetting ambt naar ORE'!W46,'Lijst omzettingen'!$B$1:$H$1)))))","v":""}]
[{"$nulls":36},"",{"$f":"IF(AB47=\"\",\"\",IF(AB47=\"voltijds\", 12875, IF(AB47=\"halftijds\",6437,INDEX('Lijst omzettingen'!$B$3:$H$38,MATCH('omzetting ambt naar ORE'!AB47,'Lijst omzettingen'!$A$3:$A$38,0),MATCH('omzetting ambt naar ORE'!W47,'Lijst omzettingen'!$B$1:$H$1)))))","v":""}]
[{"$nulls":36},"",{"$f":"IF(AB48=\"\",\"\",IF(AB48=\"voltijds\", 12875, IF(AB48=\"halftijds\",6437,INDEX('Lijst omzettingen'!$B$3:$H$38,MATCH('omzetting ambt naar ORE'!AB48,'Lijst omzettingen'!$A$3:$A$38,0),MATCH('omzetting ambt naar ORE'!W48,'Lijst omzettingen'!$B$1:$H$1)))))","v":""}]
[{"$nulls":36},"",{"$f":"IF(AB49=\"\",\"\",IF(AB49=\"voltijds\", 12875, IF(AB49=\"halftijds\",6437,INDEX('Lijst omzettingen'!$B$3:$H$38,MATCH('omzetting ambt naar ORE'!AB49,'Lijst omzettingen'!$A$3:$A$38,0),MATCH('omzetting ambt naar ORE'!W49,'Lijst omzettingen'!$B$1:$H$1)))))","v":""}]
[{"$nulls":36},"",{"$f":"IF(AB50=\"\",\"\",IF(AB50=\"voltijds\", 12875, IF(AB50=\"halftijds\",6437,INDEX('Lijst omzettingen'!$B$3:$H$38,MATCH('omzetting ambt naar ORE'!AB50,'Lijst omzettingen'!$A$3:$A$38,0),MATCH('omzetting ambt naar ORE'!W50,'Lijst omzettingen'!$B$1:$H$1)))))","v":""}]
[{"$nulls":36},"",{"$f":"IF(AB51=\"\",\"\",IF(AB51=\"voltijds\", 12875, IF(AB51=\"halftijds\",6437,INDEX('Lijst omzettingen'!$B$3:$H$38,MATCH('omzetting ambt naar ORE'!AB51,'Lijst omzettingen'!$A$3:$A$38,0),MATCH('omzetting ambt naar ORE'!W51,'Lijst omzettingen'!$B$1:$H$1)))))","v":""}]
[{"$nulls":36},"",{"$f":"IF(AB52=\"\",\"\",IF(AB52=\"voltijds\", 12875, IF(AB52=\"halftijds\",6437,INDEX('Lijst omzettingen'!$B$3:$H$38,MATCH('omzetting ambt naar ORE'!AB52,'Lijst omzettingen'!$A$3:$A$38,0),MATCH('omzetting ambt naar ORE'!W52,'Lijst omzettingen'!$B$1:$H$1)))))","v":""}]
[{"$nulls":36},"",{"$f":"IF(AB53=\"\",\"\",IF(AB53=\"voltijds\", 12875, IF(AB53=\"halftijds\",6437,INDEX('Lijst omzettingen'!$B$3:$H$38,MATCH('omzetting ambt naar ORE'!AB53,'Lijst omzettingen'!$A$3:$A$38,0),MATCH('omzetting ambt naar ORE'!W53,'Lijst omzettingen'!$B$1:$H$1)))))","v":""}]
[{"$nulls":36},"",{"$f":"IF(AB54=\"\",\"\",IF(AB54=\"voltijds\", 12875, IF(AB54=\"halftijds\",6437,INDEX('Lijst omzettingen'!$B$3:$H$38,MATCH('omzetting ambt naar ORE'!AB54,'Lijst omzettingen'!$A$3:$A$38,0),MATCH('omzetting ambt naar ORE'!W54,'Lijst omzettingen'!$B$1:$H$1)))))","v":""}]
[]
[{"$nulls":34},"totaal",null,null,{"$f":"SUM(AL45:AL54)","v":0}]
[]
[]
[]
[null,null,"Foutmeldingen"]
{"$rows_left_out":21}
{"sheet":"Lijst instellingen","index":1,"n_rows":162,"n_cols":4,"rows_kept":162,"hidden":true}
["nummer_instelling","korte_naam_instell","adres","postnummer_gemeente"]
[54081,"Internaat Zusters van Don Bosco","Brusselstraat 285","1702 Dilbeek"]
[54114,"Montfortinternaat","Aarschotsesteenweg 39","3110 Rotselaar"]
[54122,"Don Bosco Internaat","Guldendallaan 90","1150 Sint-Pieters-Woluwe"]
[54148,"SLHD Internaat Hemelsdaele","Wapenmakersstraat 14","8000 Brugge"]
[54155,"EDUCA - Internaat","Spoorwegstraat 14","8200 Brugge"]
[54163,"Internaat Huyze Komvest","Komvest 36","8000 Brugge"]
[54171,"Internaat Poperinge Ten Bunderen","Boeschepestraat 44","8970 Poperinge"]
[54189,"Internaat De Keiwijzer","Bruggestraat 14","8970 Poperinge"]
[54239,"St-Paulusschool internaat Hemelvaart","Keukeldam 17","8790 Waregem"]
[54262,"Sint-Pietersinstituut Internaat","Koning Albertlaan 70","9000 Gent"]
[54271,"Internaat Nieuwen Bosch","Lange Violettestraat 65","9000 Gent"]
[54288,"Internaat De La Salle","Watergraafstraat 10","9000 Gent"]
[54296,"Internaat O.-L.-Vrouw Presentatie 1","Langestraat 66","9050 Gent"]
[54312,"Internaat Don Bosco","Kortrijksesteenweg 1025","9051 Gent"]
[54321,"Sint-Laurensinternaat","Dorp 21_B","9185 Wachtebeke"]
[54346,"Internaat Mariavreugde","Nieuwland 11_A","3840 Borgloon"]
[54353,"Autonoom Internaat Salvatorpeda","Salvatorstraat 20","3500 Hasselt"]
[54395,"Internaat Stadsrand","Diestersteenweg 146","3800 Sint-Truiden"]
[54403,"Abdij-internaat Hasp-O Centrum","Diesterstraat 1","3800 Sint-Truiden"]
[54411,"Internaat Instituut Mariaburcht","Stevoortse kiezel 425","3512 Hasselt"]
[54445,"GO! Autonoom Leefhuis Connect","Olmenweg 108","3971 Leopoldsburg"]
[54866,"St-Paulusschool Internaat camp College 2","Vijfseweg 2","8790 Waregem"]
[55351,"Internaat Kinderland","Sint-Anna 41","8500 Kortrijk"]
[55475,"Agneteninternaat","Bovenmeel 23","3990 Peer"]
[56036,"Internaat Tungri","Oude Kerkhofweg 1","3700 Tongeren"]
[56044,"Internaat Elckerlyc","Komvest 34_C","8000 Brugge"]
[56069,"Internaat De Polders","Polderstraat 76_F","8310 Brugge"]
[61028,"Internaat Zusters van Liefde","Hospitaalstraat 22","8610 Kortemark"]
[61069,"Internaat Don Bosco","Kasteellei 77","2110 Wijnegem"]
[100008,"GO! tehuis Etterbeek","Pater Eudore Devroyestraat 29","1040 Etterbeek"]
[100016,"GO! internaat De Spits","Thonetlaan 106","2050 Antwerpen"]
[100024,"GO! tehuis en basisschool Kubik","Heikampstraat 37","3630 Maasmechelen"]
[100032,"GO! internaat en tehuis Kastor","Boomgaardstraat 19","8520 Kuurne"]
[100041,"Go! tehuis Het Molenschip Evergem","Vurstjen 33","9940 Evergem"]
[100057,"GO! internaat MPI Neder-over-heembeek","Beizegemstraat 132","1120 Brussel"]
[100065,"GO! internaat MPI Zonnebos","Moerstraat 50_1","2970 Schilde"]
[100073,"GO! MPI de 3master","Pater Damiaanstraat 10","2460 Kasterlee"]
[100081,"GO! BSBO Groenlaar","Predikherenhoevestraat 31","2840 Rumst"]
[100099,"GO! internaat MPI De Link","Eekhoornstraat 1_","9100 Sint-Niklaas"]
[100107,"GO! BSBO Woudlucht","Prosperdreef 3","3001 Leuven"]
[100115,"GO! BSBO Heideland","Westlaan 191","3550 Heusden-Zolder"]
[100123,"GO! internaat MPI Groeicampus internaat","Richter 25","3600 Genk"]
[100131,"GO! internaat MPI De Dageraad","Tapstraat 12","3720 Kortessem"]
[100149,"GO! internaat Lommel - De Veerkracht","Speelpleinstraat 75","3920 Lommel"]
[100164,"GO! internaat MPI Koksijde","Pylyserlaan 132","8670 Koksijde"]
[100172,"GO! internaat MPI De Hazelaar","Kaproenenhof 32","8200 Brugge"]
[100181,"GO! internaat MPI De Bevertjes","Beernemstraat 4","8730 Beernem"]
[100198,"GO! autonoom internaat buo - NEST","Driftweg 77","8420 De Haan"]
[100214,"GO! internaat MPI Pottelberg Kortrijk","Pottelberg 5","8500 Kortrijk"]
[100222,"GO! internaat MPI Sterrebos","Bornstraat 52","8800 Roeselare"]
[100231,"GO! internaat MPI De Oase","Voskenslaan 362","9000 Gent"]
[100248,"GO! Internaat Het Punt","Vurstjen 25","9940 Evergem"]
[100255,"GO! internaat MPI 't Craeneveld","Serpentsstraat 63","9700 Oudenaarde"]
[100289,"Internaat Campus Kajee","Alice Nahonlei 65","2900 Schoten"]
[100313,"Stedelijk Internaat Gent Pollux","Pollepelstraat 15","9000 Gent"]
[100321,"GO! internaat IBSO De Horizon","Molendreef 57","9300 Aalst"]
[100461,"Internaat Klein Seminarie","Vrijheid 234","2320 Hoogstraten"]
[100487,"Internaat Sint-Aloysius","Kolveniersvest 24","2500 Lier"]
[100561,"Internaat Sint-Victor","Kasteelplein 20","2300 Turnhout"]
{"$rows_left_out":103}
{"sheet":"Lijst omzettingen","index":2,"n_rows":86,"n_cols":23,"rows_kept":86,"hidden":true}
["uren opdracht",125,159,501,165,202,158,542,null,null,"directeur"]
[null,"aantal ORE","aantal ORE","aantal ORE","aantal ORE","aantal ORE","aantal ORE","aantal ORE",null,"voltijds",{"v":12875,"d":"12,875"}]
[1,251,278,353,278,235,259,307,null,"halftijds",{"v":6437,"d":"6,437"}]
[2,503,556,706,556,471,519,614]
[3,754,833,{"v":1059,"d":"1,059"},833,706,778,920]
[4,{"v":1005,"d":"1,005"},{"v":1111,"d":"1,111"},{"v":1412,"d":"1,412"},{"v":1111,"d":"1,111"},942,{"v":1037,"d":"1,037"},{"v":1227,"d":"1,227"}]
[5,{"v":1257,"d":"1,257"},{"v":1389,"d":"1,389"},{"v":1766,"d":"1,766"},{"v":1389,"d":"1,389"},{"v":1177,"d":"1,177"},{"v":1297,"d":"1,297"},{"v":1534,"d":"1,534"}]
[6,{"v":1508,"d":"1,508"},{"v":1667,"d":"1,667"},{"v":2119,"d":"2,119"},{"v":1667,"d":"1,667"},{"v":1412,"d":"1,412"},{"v":1556,"d":"1,556"},{"v":1841,"d":"1,841"}]
[7,{"v":1759,"d":"1,759"},{"v":1944,"d":"1,944"},{"v":2472,"d":"2,472"},{"v":1944,"d":"1,944"},{"v":1648,"d":"1,648"},{"v":1815,"d":"1,815"},{"v":2147,"d":"2,147"}]
[8,{"v":2010,"d":"2,010"},{"v":2222,"d":"2,222"},{"v":2825,"d":"2,825"},{"v":2222,"d":"2,222"},{"v":1883,"d":"1,883"},{"v":2075,"d":"2,075"},{"v":2454,"d":"2,454"}]
[9,{"v":2262,"d":"2,262"},{"v":2500,"d":"2,500"},{"v":3178,"d":"3,178"},{"v":2500,"d":"2,500"},{"v":2119,"d":"2,119"},{"v":2334,"d":"2,334"},{"v":2761,"d":"2,761"}]
[10,{"v":2513,"d":"2,513"},{"v":2778,"d":"2,778"},{"v":3531,"d":"3,531"},{"v":2778,"d":"2,778"},{"v":2354,"d":"2,354"},{"v":2593,"d":"2,593"},{"v":3068,"d":"3,068"}]
[11,{"v":2764,"d":"2,764"},{"v":3056,"d":"3,056"},{"v":3884,"d":"3,884"},{"v":3056,"d":"3,056"},{"v":2589,"d":"2,589"},{"v":2853,"d":"2,853"},{"v":3374,"d":"3,374"}]
[12,{"v":3016,"d":"3,016"},{"v":3333,"d":"3,333"},{"v":4237,"d":"4,237"},{"v":3333,"d":"3,333"},{"v":2825,"d":"2,825"},{"v":3112,"d":"3,112"},{"v":3681,"d":"3,681"}]
[13,{"v":3267,"d":"3,267"},{"v":3611,"d":"3,611"},{"v":4590,"d":"4,590"},{"v":3611,"d":"3,611"},{"v":3060,"d":"3,060"},{"v":3371,"d":"3,371"},{"v":3988,"d":"3,988"}]
[14,{"v":3518,"d":"3,518"},{"v":3889,"d":"3,889"},{"v":4944,"d":"4,944"},{"v":3889,"d":"3,889"},{"v":3295,"d":"3,295"},{"v":3631,"d":"3,631"},{"v":4295,"d":"4,295"}]
[15,{"v":3770,"d":"3,770"},{"v":4167,"d":"4,167"},{"v":5297,"d":"5,297"},{"v":4167,"d":"4,167"},{"v":3531,"d":"3,531"},{"v":3890,"d":"3,890"},{"v":4601,"d":"4,601"}]
[16,{"v":4021,"d":"4,021"},{"v":4444,"d":"4,444"},{"v":5650,"d":"5,650"},{"v":4444,"d":"4,444"},{"v":3766,"d":"3,766"},{"v":4149,"d":"4,149"},{"v":4908,"d":"4,908"}]
[17,{"v":4272,"d":"4,272"},{"v":4722,"d":"4,722"},{"v":6003,"d":"6,003"},{"v":4722,"d":"4,722"},{"v":4002,"d":"4,002"},{"v":4409,"d":"4,409"},{"v":5215,"d":"5,215"}]
[18,{"v":4524,"d":"4,524"},{"v":5000,"d":"5,000"},{"v":6356,"d":"6,356"},{"v":5000,"d":"5,000"},{"v":4237,"d":"4,237"},{"v":4668,"d":"4,668"},{"v":5522,"d":"5,522"}]
[19,{"v":4775,"d":"4,775"},{"v":5278,"d":"5,278"},{"v":6709,"d":"6,709"},{"v":5278,"d":"5,278"},{"v":4472,"d":"4,472"},{"v":4927,"d":"4,927"},{"v":5828,"d":"5,828"}]
[20,{"v":5026,"d":"5,026"},{"v":5556,"d":"5,556"},{"v":7062,"d":"7,062"},{"v":5556,"d":"5,556"},{"v":4708,"d":"4,708"},{"v":5187,"d":"5,187"},{"v":6135,"d":"6,135"}]
[21,{"v":5277,"d":"5,277"},{"v":5833,"d":"5,833"},{"v":7415,"d":"7,415"},{"v":5833,"d":"5,833"},{"v":4943,"d":"4,943"},{"v":5446,"d":"5,446"},{"v":6442,"d":"6,442"}]
[22,{"v":5529,"d":"5,529"},{"v":6111,"d":"6,111"},{"v":7768,"d":"7,768"},{"v":6111,"d":"6,111"},{"v":5179,"d":"5,179"},{"v":5705,"d":"5,705"},{"v":6749,"d":"6,749"}]
[23,{"v":5780,"d":"5,780"},{"v":6389,"d":"6,389"},{"v":8122,"d":"8,122"},{"v":6389,"d":"6,389"},{"v":5414,"d":"5,414"},{"v":5965,"d":"5,965"},{"v":7055,"d":"7,055"}]
[24,{"v":6031,"d":"6,031"},{"v":6667,"d":"6,667"},{"v":8475,"d":"8,475"},{"v":6667,"d":"6,667"},{"v":5649,"d":"5,649"},{"v":6224,"d":"6,224"},{"v":7362,"d":"7,362"}]
[25,{"v":6283,"d":"6,283"},{"v":6944,"d":"6,944"},{"v":8828,"d":"8,828"},{"v":6944,"d":"6,944"},{"v":5885,"d":"5,885"},{"v":6483,"d":"6,483"},{"v":7669,"d":"7,669"}]
[26,{"v":6534,"d":"6,534"},{"v":7222,"d":"7,222"},{"v":9181,"d":"9,181"},{"v":7222,"d":"7,222"},{"v":6120,"d":"6,120"},{"v":6743,"d":"6,743"},{"v":7976,"d":"7,976"}]
[27,{"v":6785,"d":"6,785"},{"v":7500,"d":"7,500"},{"v":9534,"d":"9,534"},{"v":7500,"d":"7,500"},{"v":6356,"d":"6,356"},{"v":7002,"d":"7,002"},{"v":8282,"d":"8,282"}]
[28,{"v":7037,"d":"7,037"},{"v":7778,"d":"7,778"},{"v":9887,"d":"9,887"},{"v":7778,"d":"7,778"},{"v":6591,"d":"6,591"},{"v":7261,"d":"7,261"},{"v":8589,"d":"8,589"}]
[29,{"v":7288,"d":"7,288"},{"v":8056,"d":"8,056"},{"v":10240,"d":"10,240"},{"v":8056,"d":"8,056"},{"v":6826,"d":"6,826"},{"v":7521,"d":"7,521"},{"v":8896,"d":"8,896"}]
[30,{"v":7539,"d":"7,539"},{"v":8333,"d":"8,333"},{"v":10593,"d":"10,593"},{"v":8333,"d":"8,333"},{"v":7062,"d":"7,062"},{"v":7780,"d":"7,780"},{"v":9203,"d":"9,203"}]
[31,{"v":7790,"d":"7,790"},{"v":8611,"d":"8,611"},{"v":10946,"d":"10,946"},{"v":8611,"d":"8,611"},{"v":7297,"d":"7,297"},{"v":8039,"d":"8,039"},{"v":9509,"d":"9,509"}]
[32,{"v":8042,"d":"8,042"},{"v":8889,"d":"8,889"},{"v":11300,"d":"11,300"},{"v":8889,"d":"8,889"},{"v":7532,"d":"7,532"},{"v":8299,"d":"8,299"},{"v":9816,"d":"9,816"}]
[33,{"v":8293,"d":"8,293"},{"v":9167,"d":"9,167"},{"v":11653,"d":"11,653"},{"v":9167,"d":"9,167"},{"v":7768,"d":"7,768"},{"v":8558,"d":"8,558"},{"v":10123,"d":"10,123"}]
[34,{"v":8544,"d":"8,544"},{"v":9444,"d":"9,444"},{"v":12006,"d":"12,006"},{"v":9444,"d":"9,444"},{"v":8003,"d":"8,003"},{"v":8817,"d":"8,817"},{"v":10430,"d":"10,430"}]
[35,{"v":8796,"d":"8,796"},{"v":9722,"d":"9,722"},{"v":12359,"d":"12,359"},{"v":9722,"d":"9,722"},{"v":8239,"d":"8,239"},{"v":9077,"d":"9,077"},{"v":10736,"d":"10,736"}]
[36,{"v":9047,"d":"9,047"},{"v":10000,"d":"10,000"},{"v":12712,"d":"12,712"},{"v":10000,"d":"10,000"},{"v":8474,"d":"8,474"},{"v":9336,"d":"9,336"},{"v":11043,"d":"11,043"}]
{"$rows_empty":12}
[{"$f":"B3/A3","v":251},1.1075697211155378,1.2697841726618706,0.7875354107648725,0.8453237410071942,1.102127659574468,1.1853281853281854,null,{"$f":"A51*A3","v":251},{"$f":"B51*B3","v":278},{"$f":"C51*C3","v":353},{"$f":"D51*D3","v":278},{"$f":"E51*E3","v":235},{"$f":"F51*F3","v":259},{"$f":"G51*G3","v":307},null,{"$f":"EXACT(I51,B3)","v":true},{"$f":"EXACT(J51,C3)","v":true},{"$f":"EXACT(K51,D3)","v":true},{"$f":"EXACT(L51,E3)","v":true},{"$f":"EXACT(M51,F3)","v":true},{"$f":"EXACT(N51,G3)","v":true},{"$f":"EXACT(O51,H3)","v":true}]
[251.5,1.1053677932405566,1.2697841726618706,0.7875354107648725,0.8471223021582733,1.1019108280254777,1.1830443159922928,null,503,556,706,556,471,519,613.9999999999999,null,true,true,true,true,true,true,true]
[251.33333333333334,1.1047745358090186,1.2713085234093637,0.7865911237016053,0.8475390156062425,1.1019830028328612,1.1825192802056554,null,754,833,1059,833,706,778,919.9999999999999,null,true,true,true,true,true,true,true]
[251.25,1.1054726368159205,1.2709270927092708,0.7868271954674221,0.8478847884788479,1.1008492569002124,1.1832208293153328,null,1005,1111,1412,1111,942,1037,1227,null,true,true,true,true,true,true,true]
[251.4,1.1050119331742243,1.2714182865370771,0.7865232163080408,0.8473722102231821,1.1019541206457095,1.1827293754818813,null,1257,1389,1766,1389,1177,1297,1534,null,true,true,true,true,true,true,true]
[251.33333333333334,1.1054376657824934,1.271145770845831,0.7866918357715904,0.8470305938812237,1.1019830028328612,1.1831619537275064,null,1508,1667,2119,1667,1412,1556,1841,null,true,true,true,true,true,true,true]
[251.28571428571428,1.1051733939738488,1.271604938271605,0.7864077669902912,0.8477366255144033,1.1013349514563107,1.1829201101928375,null,1759,1944,2472,1944,1648,1815,2147,null,true,true,true,true,true,true,true]
[251.25,1.1054726368159205,1.2713771377137715,0.7865486725663717,0.8474347434743474,1.1019649495485926,1.1826506024096386,null,2010,2222,2825,2222,1883,2075,2454,null,true,true,true,true,true,true,true]
[251.33333333333334,1.1052166224580018,1.2712,0.7866582756450597,0.8476,1.1014629542236904,1.1829477292202228,null,2262,2500,3178.0000000000005,2500,2119,2334,2761,null,true,true,true,true,true,true,true]
[251.3,1.1054516514126542,1.2710583153347732,0.7867459643160578,0.8473722102231821,1.1015293118096856,1.1831854994215194,null,2513,2778,3531,2778,2354,2593,3068,null,true,true,true,true,true,true,true]
[{"$f":"B13/A13","v":251.27272727272728},1.105643994211288,1.2709424083769634,0.7868177136972193,0.8471858638743456,1.1019698725376594,1.182614791447599,null,2764,3055.9999999999995,3884,3056,2589,2853.0000000000005,3374,null,true,true,true,true,true,true,true]
[251.33333333333334,1.1051061007957559,1.2712271227122711,0.7866414916214303,0.8475847584758476,1.1015929203539823,1.182840616966581,null,3016,3332.9999999999995,4237,3333,2825,3112,3681,null,true,true,true,true,true,true,true]
[251.30769230769232,1.1052953780226507,1.271116034339518,0.7867102396514162,0.8474106895596788,1.1016339869281047,1.1830317413230496,null,3267,3610.9999999999995,4590,3611.0000000000005,3060,3371.0000000000005,3988,null,true,true,true,true,true,true,true]
[251.28571428571428,1.1054576463899943,1.2712779634867575,0.7866100323624595,0.8472615068140911,1.1019726858877086,1.1828697328559625,null,3518,3889,4944,3889,3295,3631,4295,null,true,true,true,true,true,true,true]
[251.33333333333334,1.1053050397877984,1.2711783057355412,0.7866717009628091,0.8473722102231821,1.101670914755027,1.182776349614396,null,3770,4167,5297,4167,3531,3890.0000000000005,4601,null,true,true,true,true,true,true,true]
[251.3125,1.1051977120119374,1.2713771377137715,0.7865486725663717,0.8474347434743474,1.1016994158258098,1.18293564714389,null,4021,4444,5650,4444,3766,4149,4908,null,true,true,true,true,true,true,true]
[251.2941176470588,1.1053370786516854,1.2712833545108004,0.7866066966516742,0.8475222363405337,1.1016991504247875,1.1828078929462462,null,4272,4722,6003,4722,4002,4409,5215,null,true,true,true,true,true,true,true]
[251.33333333333334,1.1052166224580018,1.2712,0.7866582756450597,0.8474,1.1017229171583667,1.1829477292202228,null,4524,5000,6356.000000000001,5000,4237,4668,5522,null,true,true,true,true,true,true,true]
[251.31578947368422,1.1053403141361255,1.2711254262978402,0.7867044268892532,0.8472906403940886,1.1017441860465116,1.1828699005480008,null,4775,5277.999999999999,6709.000000000001,5278,4472,4927,5828,null,true,true,true,true,true,true,true]
[251.3,1.1054516514126542,1.2710583153347732,0.7867459643160578,0.8473722102231821,1.1017417162276975,1.1827646038172355,null,5026,5556,7062,5556,4708,5187,6135,null,true,true,true,true,true,true,true]
[{"$f":"B23/A23","v":251.28571428571428},1.1053628955846124,1.2712154980284587,0.7866486850977747,0.8474198525630036,1.1017600647380132,1.1828865222181417,null,5277,5833,7414.999999999999,5833,4943,5445.999999999999,6442,null,true,true,true,true,true,true,true]
{"$rows_left_out":16}
{"sheet":"lijst ambten","index":3,"n_rows":38,"n_cols":14,"rows_kept":38,"hidden":true}
[]
[null,"ambt",null,"administratief medewerker - salarisschaal",null,"internaatsmedewerker - salarisschaal",null,"directeur - salarisschaal",{"$nulls":3},"aantal uren",null,"directeur uren"]
[null,"administratief medewerker",null,202,null,125,null,"n.v.t.",{"$nulls":3},1,null,"voltijds"]
[null,"internaatsmedewerker",null,158,null,159,{"$nulls":5},2,null,"halftijds"]
[null,"directeur",null,542,null,501,{"$nulls":5},3]
[{"$nulls":5},165,{"$nulls":5},4]
[{"$nulls":11},5]
[{"$nulls":11},6]
[{"$nulls":11},7]
[{"$nulls":11},8]
[{"$nulls":11},9]
[{"$nulls":11},10]
[{"$nulls":11},11]
[{"$nulls":11},12]
[{"$nulls":11},13]
[{"$nulls":11},14]
[{"$nulls":11},15]
[{"$nulls":11},16]
[{"$nulls":11},17]
[{"$nulls":11},18]
[{"$nulls":11},19]
[{"$nulls":11},20]
[{"$nulls":11},21]
[{"$nulls":11},22]
[{"$nulls":11},23]
[{"$nulls":11},24]
[{"$nulls":11},25]
[{"$nulls":11},26]
[{"$nulls":11},27]
[{"$nulls":11},28]
[{"$nulls":11},29]
[{"$nulls":11},30]
[{"$nulls":11},31]
[{"$nulls":11},32]
[{"$nulls":11},33]
[{"$nulls":11},34]
[{"$nulls":11},35]
[{"$nulls":11},36]

{"sheet":"Gegevensverzameling","index":4,"n_rows":2,"n_cols":4,"rows_kept":2,"hidden":true}
["Instellingsnummer","totaal ORE omgezet","foutmelding1","foutmelding2"]
[{"$f":"'omzetting ambt naar ORE'!U28","v":0},{"$f":"'omzetting ambt naar ORE'!AL56","v":0},{"$f":"IF('omzetting ambt naar ORE'!C65=\"\",0,1)","v":1},{"$f":"IF('omzetting ambt naar ORE'!C66=\"\",0,1)","v":1}]