{"text_format":"3","workbook":"xlsx","n_sheets":3,"sheets":["Formulier","Gegevens voorzieningen","Gegevens scholen"],"not_rendered":{"images":1,"macros":1,"defined_names":53,"comments":1},"read":"whole","date_system":"1900"}

{"sheet":"Formulier","index":0,"n_rows":68,"n_cols":42,"rows_kept":68,"merged":[[0,26,0,37],[2,2,2,37],[3,2,3,37],[7,2,7,21],[7,23,7,27],[8,2,8,20],[10,2,10,37],[11,2,11,37],[12,2,12,37],[13,2,13,37],[14,2,14,37],[15,2,15,37],[17,2,17,37],[20,2,20,40],[22,15,22,18],[24,15,24,37],[26,15,26,37],[28,15,28,17],[28,19,28,37],[30,15,30,21],[32,15,32,29],[35,2,35,37],[38,2,38,40],[40,15,40,29],[42,15,42,37],[44,15,44,17],[44,19,44,37],[46,15,46,29],[48,15,48,29],[51,2,51,37],[51,38,51,40],[54,0,54,1],[54,3,54,40],[55,3,55,40],[57,2,57,37],[57,38,57,40],[59,2,59,37],[60,4,60,37],[63,5,63,49],[65,4,65,37],[66,4,66,37],[67,4,67,42]]}
[{"$nulls":26},"1F3C8F-2024-01-24516\nMD158"]
[]
[null,null,"Melding van samenwerking met het Vlaams Detentiecentrum of met een voorziening veilig verblijf voor tijdelijk onderwijs aan huis"]
[null,null,"/////////////////////////////////////////////////////////////////////////////////////////////////////////////////////////////////////////////////////////////////"]
[null,null,"Agentschap voor Onderwijsdiensten"]
[null,null,"Afdeling Scholen en Leerlingen"]
[null,null,"Koning Albert II-laan 15, 1210 BRUSSEL"]
[null,null,"T 02 553 87 14"]
[null,null,"contacteer ons via Berichten in Mijn Onderwijs"]
[]
[null,null,"Waarvoor dient dit formulier?"]
[null,null,"Met dit formulier deelt de directeur of de gemandateerde van het schoolbestuur mee of de school samenwerkt met het Vlaams Detentiecentrum of met een voorziening veilig verblijf voor tijdelijk onderwijs aan huis."]
[null,null,"Wie vult dit formulier in?"]
[null,null,"De directeur of de gemandateerde van het schoolbestuur vult dit formulier in en bezorgt het aan Agodi."]
[null,null,"Waar vindt u meer informatie over dit formulier?"]
[null,null,"Meer informatie vindt u in omzendbrief SO/2005/05 (SO), SO/2005/06 (BuSO) en BaO/97/5 (BaO)."]
[]
[null,null,"Gegevens van de  instelling"]
[]
[]
[null,null,"Als u het instellingsnummer invult, verschijnen de andere gegevens van deze vraag automatisch. "]
[]
[{"$nulls":13},"instellingsnummer"]
[{"$nulls":15}," "]
[{"$nulls":13},"naam",null,{"$f":"VLOOKUP(P23,'Gegevens scholen'!A:G,2)","v":0}]
[]
[{"$nulls":13},"straat en nummer",null,{"$f":"VLOOKUP(P23,'Gegevens scholen'!A:G,3)","v":0}]
[]
[{"$nulls":13},"postnummer en gemeente",null,{"$f":"VLOOKUP(P23,'Gegevens scholen'!A:G,4)","v":0},{"$nulls":3},{"$f":"VLOOKUP(P23,'Gegevens scholen'!A:G,5)","v":0}]
[{"$nulls":15},""]
[{"$nulls":13},"telefoonnummer",null,{"$f":"VLOOKUP(P23,'Gegevens scholen'!A:G,6)","v":0}]
[]
[{"$nulls":13},"e-mail",null,{"$f":"VLOOKUP(P23,'Gegevens scholen'!A:G,7)","v":0}]
[]
[]
[null,null,"Gegevens van het Vlaams Detentiecentrum of van de voorziening veilig verblijf"]
[]
[]
[null,null,"Als u de naam selecteert, verschijnen de adresgegevens automatisch"]
[]
[{"$nulls":13},"naam"]
[{"$nulls":15}," "]
[{"$nulls":13},"straat en nummer",null,{"$f":"VLOOKUP(P41,'Gegevens voorzieningen'!A1:F21,3)","v":0}]
[]
[{"$nulls":13},"postnummer en gemeente",null,{"$f":"VLOOKUP(P41,'Gegevens voorzieningen'!A1:F21,4)","v":0},{"$nulls":3},{"$f":"VLOOKUP(P41,'Gegevens voorzieningen'!A1:F22,5)","v":0}]
[{"$nulls":15},""]
[{"$nulls":13},"aantal erkende plaatsen"]
[]
[{"$nulls":13},"periode samenwerkingsovereenkomst"]
[]
[]
[null,null,"Bij te voegen bewijsstuk"]
[]
[]
["",null,null," samenwerkingsovereenkomst tussen de instelling en het Vlaams Detentiecentrum of de voorziening veilig verblijf",{"$nulls":37},""]
[]
[]
[null,null,"Hoe en aan wie bezorgt u dit formulier?"]
[]
[null,null,"Bezorg ons dit formulier via de nieuwe optie ‘Document versturen’ van Mijn Onderwijs. \nOm dit formulier en het bewijsstuk in te dienen, hebt u toegang nodig tot het thema ‘Structuur en organisatie’ in Mijn Onderwijs. U kunt die rechten nakijken in het tabblad ‘Thema beheer’.\n"]
[{"$nulls":3},"-","Log in op Mijn Onderwijs en ga naar het niveau basisonderwijs of secundair onderwijs. Klik op het tabblad ‘Document versturen’."]
[{"$nulls":3},"- ","Kies ‘Document versturen’ en vul de verplichte velden in."]
[{"$nulls":3},"","-","Selecteer de instelling waarvoor u een document wilt versturen."]
[{"$nulls":4},"-","Selecteer het juiste formulier uit de lijst: ‘ORG11 – Melding van samenwerking met Vl. Detentiecentrum of Voorziening Veilig Verblijf voor TOAH’."]
[{"$nulls":4},"-","Selecteer het schooljaar waarover het gaat."]
[{"$nulls":3},"-","Klik in hetzelfde scherm op de knop '+Bijlage toevoegen' en selecteer het opgeslagen bestand. Daarna wordt de naam van het toegevoegde bestand onder de knop '+Bijlage toevoegen' weergegeven."]
[{"$nulls":3},"-","Klik op de knop 'Stuur document(en) door' om het bestand aan de afdeling Scholen en Leerlingen te bezorgen. Daarna verschijnt in het scherm 'Document versturen' een blauwe balk met de vermelding 'Uw document(en) zijn succesvol verstuurd'."]
[{"$nulls":3},"-","Als het document is opgeladen, vindt u het terug onder het tabblad 'Documenten' bij 'Verstuurd door instelling'."]

{"sheet":"Gegevens voorzieningen","index":1,"n_rows":21,"n_cols":6,"rows_kept":21,"hidden":true}
["Voorziening","Adres",{"$nulls":3},"Capaciteit veilig verblijf"]
["DE HAGEWINDE - DE KADANS","Poststraat 6, 9160 Lokeren","Poststraat 6",9160,"Lokeren",6]
["DE SCHIPBREUKELINGEN","Marie Christinastraat 8, 3070 Kortenberg","Marie Christinastraat 8",3070,"Kortenberg",3]
["DE WISSEL","Martelarenplein 13, 3000 Leuven","Martelarenplein 13",3000,"Leuven",6]
["ELEGAST","Belgiëlei 203, 2018 Antwerpen","Belgiëlei 203",2018,"Antwerpen",6]
["GRIENTA","Zusters Philippus Neristraat 6, 9900 Eeklo","Zusters Philippus Neristraat 6",9900,"Eeklo",12]
["HEEM","Halmaalweg 2, 3800 Sint-Truiden","Halmaalweg 2",3800,"Sint-Truiden",18]
["Jeugdzorg Emmaüs Antwerpen","Waarlooshofstraat 3, 2020 Antwerpen","Waarlooshofstraat 3",2020,"Antwerpen",13]
["Jeugdzorg Emmaüs Mechelen","Edgard Tinellaan 1, 2800 Mechelen","Edgard Tinellaan 1",2800,"Mechelen",6]
["KLAVIER VEILIG VERBLIJF","Zwart Goor 1, 2330 Merksplas","Zwart Goor 1",2330,"Merksplas",6]
["MINOR-NDAKO","Vogelenzangstraat 76, 1070 Anderlecht","Vogelenzangstraat 76",1070," Anderlecht",6]
["OC SINT-IDESBALD VEILIG VERBLIJF","De Zilten 52, 8800 Roeselare","De Zilten 52",8800,"Roeselare",6]
["OVBJ DE VIJVER - TWIST","Bosuil 138, 2100 Antwerpen","Bosuil 138",2100,"Antwerpen",6]
["OVBJ MPI OOSTERLO","Eindhoutseweg 25, 2440 Geel","Eindhoutseweg 25",2440,"Geel",6]
["RUYSKENSVELD","Termurenlaan 20, 9320 Aalst","Termurenlaan 20",9320,"Aalst",6]
["VERENIGING ONS TEHUIS","Poperingseweg 30, 8900 Ieper","Poperingseweg 30",8900,"Ieper",12]
["VLAAMS DETENTIECENTRUM","Schaarbeekstraat 2, 9120 Beveren","Schaarbeekstraat 2",9120,"Beveren",8]
["WAGENSCHOT Veilig Verblijf","Steenweg 2, 9810 Nazareth","Steenweg 2",9810,"Nazareth",6]
["WINGERDBLOEI","Waterbaan 153, 2100 Antwerpen","Waterbaan 153",2100,"Antwerpen",18]
["ZORGBEDRIJF ANTWERPEN","Ballaarstraat 35, 2018 Antwerpen","Ballaarstraat 35",2018,"Antwerpen",6]
[0,0,0,0,0,0]

{"sheet":"Gegevens scholen","index":2,"n_rows":3872,"n_cols":7,"rows_kept":3872,"hidden":true}
[0,0,0,0,0,0,0]
[18,"GO! BS De Kleurdoos Brussel","Moutstraat 24","1000","BRUSSEL","02-512.49.79","info@bsdekleurdoos.be"]
[26,"GO! BS 't Plant'zoentje Laken","Karel Bogaerdstraat 4","1020","LAKEN","02-474.06.20","sec@hetplantzoentje.be"]
[34,"GO! BS Hendrik Conscience Schaarbeek","Gustave Latinislaan 94","1030","SCHAARBEEK","02-215.99.95","directeur@hendrikconscience.be"]
[42,"GO! BS Atheneum Etterbeek","Edmond Mesenslaan 2","1040","ETTERBEEK","02-732.17.04","secretariaat@bsetterbeek.be"]
[59,"GO! Tehuis en BS Etterbeek","Pater Eudore Devroyestraat 29","1040","ETTERBEEK","02-734.19.05","jana.coppens@tehuisbrussel.be"]
[67,"GO! BS De Wimpel Elsene","Cansstraat 14","1050","ELSENE","02-511.52.30","secretariaat@dewimpel.be"]
[75,"GO! BS De Bron","Bronstraat 86_A","1060","SINT-GILLIS","02-538.54.52","secretariaat.debron@sgrbrussel.be"]
[83,"GO! LS Toverfluit","Toverfluitstraat 21","1080","SINT-JANS-MOLENBEEK","02-413.11.30","sabine.vanheeswijck@campustoverfluit.be"]
[91,"GO! BS De Goudenregen","Frans Vervaeckstraat 47","1083","GANSHOREN","02-421.54.00","secretariaat@degoudenregen.be"]
[109,"GO! BS Unescoschool Koekelberg","Klein-Berchemstraat 1","1081","KOEKELBERG","02-468.16.16","guray.turkistan@unescoschool.be"]
[117,"GO!BS Zavelberg","Oscar Ruelensplein 13","1082","SINT-AGATHA-BERCHEM","02-482.01.05","liesbet.doucet@zavelberg.be"]
[125,"GO! BS Kasteel Beiaard","Kruipweg 23","1120","NEDER-OVER-HEEMBEEK","02-268.18.97","bart.laevens@kasteelbeiaard.be"]
[133,"GO! BS De Weg-wijzer Evere","Sint-Vincentiusstraat 29","1140","EVERE","02-241.58.09","directie@de-wegwijzer.be"]
[141,"GO! BS De Zonnewijzer","Grote Prijzenlaan 59","1150","SINT-PIETERS-WOLUWE","02-770.85.56","heidi.trappeniers@de-zonnewijzer.be"]
[158,"GO! BS De Stadsmus Oudergem","Henri de Brouckèrelaan 16","1160","OUDERGEM","02-672.87.18","secretariaat@destadsmus.be"]
[166,"GO! BS De Bloeiende Kerselaar","Louis Vander Swaelmenlaan 25","1170","WATERMAAL-BOSVOORDE","02-660.39.41","kristel.derdelinckx@debloeiendekerselaar.be"]
[174,"GO! BS Floreal Ukkel","Floréallaan 14","1180","UKKEL","02-340.68.90","directie@bsfloreal.be"]
[182,"GO! BS Floralia","Floraliënstraat 29","1200","SINT-LAMBRECHTS-WOLUWE","02-771.59.71","directie@bsfloralia.be"]
[191,"GO! BS De Leerboom","Auguste Demaeghtlaan 40","1500","HALLE","02-363.82.42","secretariaat.basisschool@go-campushalle.be"]
[208,"GO! BS Zilverberk","Pastoor Bernaertsstraat 28","1500","HALLE","02-356.78.89","secretariaat@zilverberkhalle.be"]
[216,"GO! BS Markevallei","Waardestraat 17","1540","HERNE","02-396.13.76","secretariaat@bsmarkevallei.be"]
[232,"GO! BS De Groene Parel","Albert Van Cotthemstraat 110","1600","SINT-PIETERS-LEEUW","02-377.82.12","secretariaat@degroeneparel.be"]
[257,"GO! BS Spronk","Karel Keymolenstraat 39","1750","LENNIK","02-532.33.65","secretariaat.basisschool@campusstronk.be"]
[265,"GO! BS Vijverbeek","Nieuwstraat 124_A","1730","ASSE","02-451.61.02","secretariaat.basisschool@vijverbeek.be"]
[273,"GO! BS De Vlinder","Kasteelstraat 76","1700","DILBEEK","02-569.39.47","secretariaat@devlinderdilbeek.be"]
[281,"GO! BS Horizon","Keizerstraat 35","1740","TERNAT","02-582.52.76","secretariaat@bshorizon.bee"]
[299,"GO! BS De Bij Liedekerke","Kleemputtenstraat 16","1770","LIEDEKERKE","053-46.33.00","info@debij.be"]
[307,"GO! BS Klim-Op Vilvoorde","Ledeganckstraat (Karel) 16","1800","VILVOORDE","02-251.35.61","info@klimopvilvoorde.be"]
[315,"GO! BS Kaleido","Leuvensestraat 117","1800","VILVOORDE","02-251.58.17","directeur@kaleido-vilvoorde.be"]
[323,"GO! BS De Sterrenhemel","Koning Albertlaan 1","1830","MACHELEN","02-251.39.31","directeur@desterrenhemel.be"]
[331,"GO! BS De Regenboog","Speelbroek 38","1850","GRIMBERGEN","02-269.31.45","directeur@deregenbooggrimbergen.be"]
[349,"GO! BS De Zonnebloem","Karel Baudewijnslaan 26","1861","WOLVERTEM","02-269.52.22","secretariaat@bs-zonnebloem.be"]
[356,"GO! BS De Duizendpootrakkers","Ringlaan 2","1745","OPWIJK","052-35.56.16","secretariaat@duizendpootrakkers.be"]
[364,"GO! BS 't Kasteeltje","Stafh. Braffortlaan 6","3090","OVERIJSE","02-688.22.31","bs.overijse@telenet.be"]
[372,"GO! BS De Vleugel","Spoorwegstraat 27","1930","ZAVENTEM","02-720.17.92","directeur@go-devleugel.be"]
[381,"GO! BS De KATtensprong","Hippolyte Boulengerlaan 7","3080","TERVUREN","02-766.11.12","info@kattensprong.be"]
[398,"GO! BS Het Groene Dal","Willem Matstraat 4","1560","HOEILAART","02-657.42.98","directeur@hetgroenedal.be"]
[406,"GO! BS De Pijl Antwerpen","Pijlstraat 2","2060","ANTWERPEN","03-232.71.50","directie@depijl.be"]
[414,"GO! BS De Spits Antwerpen","Thonetlaan 106","2050","ANTWERPEN","03-210.95.84","directie@de-spits.be"]
[422,"GO! BS Het Laerhof MERKSEM","Laarsebaan 100","2170","MERKSEM","03-645.08.06","directie@hetlaerhof.be"]
[431,"GO! BS 3Hoek Ekeren","Kloosterstraat 39","2180","EKEREN","03-541.62.54","directie@3hoek-ekeren.be"]
[448,"GO! BS Irishof","Kapelsestraat 37","2950","KAPELLEN","03-660.13.04","directie@irishof.be"]
[455,"GO! BS De Stappe","Geelvinckstraat 15","2940","STABROEK","03-568.31.92","directie@bs-destappe.be"]
[463,"GO! KS Het Notendopje","Veldstraat 80","2110","WIJNEGEM","03-354.30.23","directie@hetnotendopje.be"]
[471,"GO! BS Groei!","Lindenlei 27","2900","SCHOTEN","03-658.78.11","directie@bsschoten.be"]
[489,"GO! BS De Brug","Brugstraat 83","296002","SINT-JOB-IN-'T-GOOR","03-636.11.44","directie@bsdebrug.be"]
[497,"GO! BS Wonderwijs","Augustijnslei 54","2930","BRASSCHAAT","0491-96.91.58","basisschool@wonderwijsbrasschaat.be"]
[505,"GO! BS 't Park","Herentalsebaan 54","239002","OOSTMALLE","03-312.02.31","emmanuela.vervoort@inventoscholen.be"]
[513,"GO! BS Klim-op","Heybleukenstraat 21","2980","ZOERSEL","03-383.25.95","info@klim-op.net"]
[521,"GO! KS Daltonschool De Vinkjes","Nieuwe Buiten 1","2990","WUUSTWEZEL","03-669.63.61","directie@tscholeke-devinkjes.be"]
[539,"GO! BS De 4sprong-3D","Ganzendries 14","2920","KALMTHOUT","03-666.98.35","directie@de4sprong-3D.be"]
[547,"GO! BS Freinetschool WonderWereld","Hofstraat 14","2910","ESSEN","03-667.25.03","directie@freinetwonderwereld.be"]
[554,"GO! BS Plantijntje","Plantin en Moretuslei 163","2140","BORGERHOUT","03-235.36.90","directie@bsplantijntje.be"]
[562,"GO! BS De Boomgaard","Luit. Karel Caluwaertsstraat 41","2160","WOMMELGEM","03-353.73.01","secretariaat@bsdeboomgaard.be"]
[571,"GO! BS Vennebos","Kasteeldreef 24","2970","SCHILDE","03-383.08.15","christine.claessens@vennebos.be"]
[588,"GO! BS Leefschool 't Zandhofje","Liersebaan 51","2240","ZANDHOVEN","03-484.34.48","directie@zandhofje.be"]
[596,"GO! BS De Zevensprong","Albert Kanaalstraat 31","2560","NIJLEN","03-481.82.92","directie@bsdezevensprong.be"]
[604,"GO! BS 't Klavertje","Vonckstraat 44","2270","HERENTHOUT","014-51.13.39","directie@bsklavertje.be"]
[612,"GO! BS De Wijngaard","Wijngaardstraat 13","2280","GROBBENDONK","014-51.33.82","directie@bs-dewijngaard.be"]
[621,"GO! BS Kameleon","Hertoginstraat 124","2300","TURNHOUT","014-41.41.78","directie@basisschoolkameleon.be"]
[638,"GO! BS De Smiskens","Smiskensstraat 58","2300","TURNHOUT","014-41.30.76","directie@desmiskens.be"]
[653,"GO! BS 't Locomotiefje","Karel Van Nyenlaan 12","2340","BEERSE","014-61.38.40","info@locomotiefje.be"]
[679,"GO! BS Talentenschool Blink","Bovenheide 27","2380","RAVELS","014-65.59.44","directie@talentenschoolblink.be"]
[687,"GO! BS De Spoorzoeker","Guido Gezellestraat 10","2400","MOL","014-31.11.50","directie@bshetschrijvertje.be"]
[703,"GO! BS De Vesten","Augustijnenlaan 31","2200","HERENTALS","014-21.10.60","directie@bsherentals.be"]
[711,"GO! BS Freinetschool De Vlindertuin","Berg 10","2275","LILLE","014-88.06.35","directie@freinetschoollille.be"]
[729,"GO! BS Willem Tell","Voortkapelseweg 2","2250","OLEN","014-26.30.58","directie@bs-willemtell.com"]
[737,"GO! BS De Luchtballon","Lebonstraat 45","2440","GEEL","014-58.60.46","els.lenaerts@gogeel.be"]
[752,"GO! BS De Zevensprong","Netestraat 33","2480","DESSEL","014-37.74.82","directie@zevensprongdessel.be"]
[761,"GO! BS Curieuzeneuzen","Boudewijnlaan 15_1","2490","BALEN","014-81.17.38","directie@curieuzeneuzen.school"]
[794,"GO! Atheneum Lier BS Het Molentje","Eeuwfeestlaan 190","2500","LIER","03-480.05.69","grietr@atheneumlier.be"]
[802,"GO! Atheneum Lier BS Stadspark","Arthur Vanderpoortenlaan 35","2500","LIER","03-480.78.80","info@stadspark-atheneumlier.be"]
[811,"GO! BS Bisterveld","Nieuwstraat 26","256002","KESSEL","03-480.20.39","directie@bisterveld.be"]
[828,"GO! BS De Bolster","Hof van Riethlaan 3","2640","MORTSEL","03-449.89.05","directie@bolsterdorp.be"]
[836,"GO! BS 't Kofschip","Baron de Celleslaan 1","2650","EDEGEM","03-448.13.43","directie@bstkofschip.be"]
[844,"GO! BS 't Groen Schooltje","Boechoutsesteenweg 31","2540","HOVE","03-455.48.06","info@tgroenschooltje.be"]
[851,"GO! BS De Schans","Kruisschanslei 42","2550","KONTICH","03-457.32.73","directie@deschans-kontich.be"]
[869,"GO! BS Kiliaan","Rooienberg 52","2570","DUFFEL","015-31.17.52","directie@kiliaan.be"]
[877,"GO! Atheneum Lier BS LS Dagpauwoog","Dorpsstraat 63","250001","KONINGSHOOIKT","03-482.14.15","directie@dagpauwoog.be"]
[885,"GO! BS Parkschool Ieperman","Kerkelei 43","2610","WILRIJK","03-827.11.18","info@parkschoolieperman.be"]
[893,"GO! BS Mercator Rupelmonde","Geeraard de Cremerstraat 91_A","915003","RUPELMONDE","03-774.18.23","info@mercatorschool.be"]
[901,"GO! BS De Blokkendoos","Leon Gilliotlaan 58","2630","AARTSELAAR","03-887.66.91","directeur@bsdeblokkendoos.be"]
[919,"GO! BS De Hoeksteen","Tuyaertsstraat 53","2850","BOOM","03-888.02.17","directeur@dehoeksteen-boom.be"]
[927,"GO! BS Park","Van Leriuslaan 221","2850","BOOM","03-888.20.18","directeur@boompark.be"]
[935,"GO! BS 't Kasteeltje","Molenstraat 7","2870","PUURS-SINT-AMANDS","03-889.15.30","directeur@kasteeltje-puurs.be"]
[943,"GO! BS De Linde","Lindestraat 123_A","2880","BORNEM","03-897.98.16","info@bsdelinde.net"]
[951,"GO! BS De Schorre","Jan Van Droogenbroeckstraat 49","2890","PUURS-SINT-AMANDS","052-33.21.05","directeur@bsdeschorre.be"]
[968,"GO! BS De Klimroos-De Wijsneus Temse","Clemens De Landtsheerlaan 3","9140","TEMSE","03-771.07.12","bs.klimroos.temse@telenet.be"]
[976,"GO! BS De Tovertuin Sint-Niklaas","Slachthuisstraat 68","9100","SINT-NIKLAAS","03-766.64.44","directie@detovertuin.be"]
[984,"GO! BS De Watertoren Sint-Niklaas","Watertorenstraat 1","9100","SINT-NIKLAAS","03-780.79.15","directie@bsdewatertoren.be"]
[1008,"GO! BS Het Laar","Laarstraat 10","2070","ZWIJNDRECHT","03-252.80.95","directie@basisschoolhetlaar.be"]
[1016,"GO! BS De Bever Beveren-Waas","Donkvijverstraat 30","9120","BEVEREN-WAAS","03-750.96.85","directie@bsdebever.be"]
[1024,"GO! BS Reynaert Kruibeke","Kattestraat 68","9150","KRUIBEKE","03-774.15.68","directie@basisschoolreynaert.be"]
[1032,"GO! BS De Bron De Klinge","Buitenstraat 2","9170","SINT-GILLIS-WAAS","03-770.57.11","directie@bsdebron.be"]
[1041,"GO! BS De Zonnewijzer","Beukenlaan 9","9130","KIELDRECHT","03-773.47.90","directie@sterappel.be"]
[1057,"GO! BS Dubbelsprong","Zandpoortvest 9","2800","MECHELEN","015-20.32.36","directie@dubbelsprong.be"]
[1065,"GO! BS Lyceum","Caputsteenstraat 49","2800","MECHELEN","015-20.43.09","info@bslyceum.be"]
[1073,"GO! BS de Vlindertuin","Cypriaan de Rorestraat 25","2800","MECHELEN","015-41.16.02","directie@devlindertuinmechelen.be"]
[1081,"GO! BS Atheneum Keerbergen","Vlieghavenlaan 18","3140","KEERBERGEN","015-23.53.61","directie@basisschool-keerbergen.be"]
[1099,"GO! BS Alice Nahon","Mechelbaan 559","2580","PUTTE","015-76.75.22","directie@alicenahonschool.be"]
[1107,"GO! BS Dr Jozef Weyns","Jan De Cordesstr. 58","258001","BEERZEL","015-76.71.21","secretariaat@bs-drjozefweyns.be"]
[1123,"GO! BS Ter Berken","Ambroossteenweg 13","1981","HOFSTADE","015-61.23.69","directie@terberken.be"]
[1149,"GO! BS Hertog Karel Wilsele","Hoogveldweg 5","3012","WILSELE","016-44.46.37","secretariaat@hertogkarel.be"]
[1156,"GO! BS Pee & Nel","Jean-Baptiste Van Monsstraat 6","3000","LEUVEN","016-20.74.51","annick.tricot@huis11.be"]
[1164,"GO! BS De Klare Bron/De Grasmus","Jules Vandenbemptlaan 14","3001","HEVERLEE","016-22.26.73","begga.willems@huis11.be"]
[1172,"GO! BS Hertog Jan","Kerkhoflaan 28","3070","KORTENBERG","02-759.68.25","directie@hertogjan.be"]
[1181,"GO! BS Spectrum","Tiendeschuurstraat 17","1910","KAMPENHOUT","016-65.54.27","directie@go-spectrum.be"]
[1198,"GO! BS 't Wensbos","Frans Coeckelbergsstraat 17_A","2220","HEIST-OP-DEN-BERG","0477-82.11.21","directie.twensbos@atheneumheist.be"]
[1206,"GO! BS De Cocon","Veldonkstraat 10","3120","TREMELO","016-53.16.98","directie@bs-decocon.be"]
[1222,"GO! BS De Letterboom","Kerkstraat 10","2230","HERSELT","014-54.49.80","directie@bs-deletterboom.be"]
[1231,"GO! BS Daltonschool Het Leerlabo","Spikdorenveld 22","2260","WESTERLO","014-53.86.56","directie.daltonschool@hetleerlabo.be"]
[1248,"GO! BS Regenboog Kessel-Lo","Schoolstraat 2","3010","KESSEL-LO","016-25.74.46","wout.debeuckelaer@huis11.be"]
[1255,"GO! BS De Winge Tielt-Winge","Halensebaan 16","3390","SINT-JORIS-WINGE","016-63.45.32","onthaal@bsdewinge.be"]
[1263,"GO! BS Zonnedorp Aarschot","Bogaardenlaan 8","3200","AARSCHOT","016-68.98.22","onthaal@bszonnedorp.be"]
[1271,"GO! BS De Hoogvlieger Aarschot","Herseltsesteenweg 221","3200","AARSCHOT","016-56.62.64","onthaal@bsdehoogvlieger.be"]
[1289,"GO! BS 't Dorp campus Ebdries","Ebdries 11","3202","RILLAAR","016-50.91.00","onthaal@bstdorp.be"]
[1297,"GO! BS Freinetschool De Pit Diest","Overstraat 37","3290","DIEST","013-35.55.69","ingrid.geerkens@adite.be"]
[1305,"GO! BS De Kleine Prins","Weerstandsplein 1","3290","DIEST","013-35.14.70","onthaal@dekleineprinsdiest.be"]
[1313,"GO! BS 't Klein Atheneum Tienen","Oude Vestenstraat 12","3300","TIENEN","016-81.68.45","ilse.neyskens@kleinatheneum.be"]
{"$rows_left_out":3752}